Contributor role
type: Class

Role
type: Class

Work
type: Class

Associated agent
type: ObjectProperty
domain: Contributor role
range: Agent

Contributor and role
type: ObjectProperty
domain: Class
  union of: TextualBody
  union of: Event
  union of: Digital Facsimile
range: Contributor role

Contributor role
type: ObjectProperty
domain: Contributor role
range: Role

Format
type: DatatypeProperty
type: FunctionalProperty
domain: Class
  union of: TextualBody
  union of: Area
  union of: Surface
range: Literal
definition: The file format, physical medium, or dimensions of the resource. Recommended practice is to use a controlled vocabulary where available. For example, for file formats one could use the list of Internet Media Types. In the Maps of God Portal this property itself is used within the body of an annotation and should not have a value other than 'application/tei+xml'. For all other indications of formats see the available sub-properties.
example: example:Annotation5 a ilanot:VariantItems ; oa:hasBody [ a oa:TextualBody ; rdf:value " Any comment on the variants here... " ; dc:language "en"; dc:format "application/tei+xml". ] ; oa:hasTarget [] .

Language
type: DatatypeProperty
type: FunctionalProperty
domain: TextualBody
range: string
definition: A language of the resource. Recommended practice is to use either a non-literal value representing a language from a controlled vocabulary such as ISO 639-2 or ISO 639-3, or a literal value consisting of an IETF Best Current Practice 47 language tag. In the Maps of God portal this property is used within the body of an annotation; possible values are 'en', 'la' and 'he' only.
example: example:Annotation5 a ilanot:VariantItems ; oa:hasBody [ a oa:TextualBody ; rdf:value " Any comment on the variants here... " ; dc:language "en"; dc:format "application/tei+xml". ] ; oa:hasTarget [] .

Value
type: DatatypeProperty
type: FunctionalProperty
domain: TextualBody
range: string
definition: RDFs provides no substantial definition of this term. In the Maps of God portal it is (in compliance with the W3C Annotation Framework) used in an annotation body
example: example:Annotation5 a ilanot:VariantItems ; oa:hasBody [ a oa:TextualBody ; rdf:value " Any comment on the variants here... " ; dc:language "en"; dc:format "application/tei+xml". ] ; oa:hasTarget [] .

Collection
type: Class
definition: A Collection is a subtype of Object that represents ordered or unordered sets of Object or Link instances. Refer to the Activity Streams 2.0 Core specification for a complete description of the Collection type.

OrderedCollection
type: Class
subclass of: Collection
definition: A subtype of Collection in which members of the logical collection are assumed to always be strictly ordered.

items
type: ObjectProperty
domain: Collection
range: Map Item
definition: Identifies the items contained in a collection. The items might be ordered or unordered.

Annotation
type: Class
definition: The class for Web Annotations

Choice
type: Class
subclass of: OrderedCollection
alternative label: Annotation Body - Choice
definition: A subClass of as:OrderedCollection that conveys to a consuming application that it should select one of the resources in the as:items list to use, rather than all of them. This is typically used to provide a choice of resources to render to the user, based on further supplied properties. If the consuming application cannot determine the user's preference, then it should use the first in the list.

Composite
type: Class
subclass of: OrderedCollection
alternative label: Annotation Target - Composite Group
definition: A subClass of as:OrderedCollection that conveys to a consuming application that it should use all of the resources in the as:items list, but that order is not important.

Independents
type: Class
creator: http://orcid.org/0000-0003-3572-6170
date: 2021-04-09T13:28:17Z
subclass of: OrderedCollection
alternative label: Annotation Target - Group of Individuals
definition: A subClass of as:OrderedCollection that conveys to a consuming application that each of the resources in the as:items list are independently associated with all of the other bodies or targets.

TextualBody
type: Class
alternative label: Annotation Body - Text
definition: The body of an oa:Annotation, which contains an editorial comment or a note on variant items.

hasBody
type: ObjectProperty
type: FunctionalProperty
comment: The object of the relationship is a resource that is a body of the Annotation.
domain: Annotation
range: Class
  union of: Choice
  union of: TextualBody
example: item:Annotation6 a ilanot:EditorialComment ; oa:hasBody [ a oa:TextualBody ; rdf:value " Any editorial comment here... " ; dc:language "en"; dc:format "application/tei+xml". ] ; oa:hasTarget [] .

hasTarget
type: ObjectProperty
type: FunctionalProperty
domain: Annotation
range: Class
  union of: Composite
  union of: Independents
  union of: Map Item
definition: The relationship between an Annotation and its Target.

Agent
type: Class

Organization
type: Class
subclass of: Agent

Person
type: Class
subclass of: Agent

Name
type: DatatypeProperty
domain: Class
  union of: Agent
  union of: Family
  union of: Zone
range: Literal
definition: A name for some thing

Abraham ben Samuel Abulafia: Or ha-Sekhel
type: NamedIndividual
type: Work

Abraham ben Samuel Abulafia: Otzar Eden Ganuz
type: NamedIndividual
type: Work

Abraham ben Samuel Abulafia: Sitrei Torah
type: NamedIndividual
type: Work

Amos
type: NamedIndividual
type: Work

Arakhin
type: NamedIndividual
type: Work
label: ערכין @he

Avodah Zarah
type: NamedIndividual
type: Work
label: עבודה זרה @he

Avot DeRabbi Natan
type: NamedIndividual
type: Work
label: אבות דרבי נתן @he

Avot DeRabbi Natan, Recension B
type: NamedIndividual
type: Work
label: אבות דרבי נתן נוסח ב @he

Abraham bar Hiyya ha-Nasi: Book of Intercalation
type: NamedIndividual
type: Work

Bava Batra
type: NamedIndividual
type: Work
label: בבא בתרא @he

Bava Kamma
type: NamedIndividual
type: Work
label: בבא קמא @he

Bava Metzia
type: NamedIndividual
type: Work
label: בבא מציעא @he

Beitzah
type: NamedIndividual
type: Work
label: ביצה @he

Bekhorot
type: NamedIndividual
type: Work
label: בכורות @he

Berakhot
type: NamedIndividual
type: Work
label: ברכות @he

Booklet of kabbalistic forms
type: NamedIndividual
type: Work

Chagigah
type: NamedIndividual
type: Work
label: חגיגה @he

Chullin
type: NamedIndividual
type: Work
label: חולין @he

Daniel
type: NamedIndividual
type: Work

Deuteronomy
type: NamedIndividual
type: Work

Ecclesiastes
type: NamedIndividual
type: Work

Eruvin
type: NamedIndividual
type: Work
label: עירובין @he

Esther
type: NamedIndividual
type: Work

Exodus
type: NamedIndividual
type: Work

Ezekiel
type: NamedIndividual
type: Work

Ezra
type: NamedIndividual
type: Work

Genesis
type: NamedIndividual
type: Work

Joseph ben Abraham Gikatilla: Hassaggot al Moreh Nevukim
type: NamedIndividual
type: Work

Joseph ben Abraham Gikatilla: Sod ha-Nahash
type: NamedIndividual
type: Work

Gittin
type: NamedIndividual
type: Work
label: גיטין @he

Guide for the Perplexed
type: NamedIndividual
type: Work

Haggai
type: NamedIndividual
type: Work

Horayot
type: NamedIndividual
type: Work
label: הוריות @he

Hosea
type: NamedIndividual
type: Work

I Chronicles
type: NamedIndividual
type: Work

II Chronicles
type: NamedIndividual
type: Work

II Kings
type: NamedIndividual
type: Work

II Samuel
type: NamedIndividual
type: Work

I Kings
type: NamedIndividual
type: Work

I Samuel
type: NamedIndividual
type: Work

Isaiah
type: NamedIndividual
type: Work

Commentary on the 32 Pathways from the mouths of the earliest sages
type: NamedIndividual
type: Work

Jeremiah
type: NamedIndividual
type: Work

Job
type: NamedIndividual
type: Work

Joel
type: NamedIndividual
type: Work

Jonah
type: NamedIndividual
type: Work

Joshua
type: NamedIndividual
type: Work

Judges
type: NamedIndividual
type: Work

Keritot
type: NamedIndividual
type: Work
label: כריתות @he

Ketubot
type: NamedIndividual
type: Work
label: כתובות @he

Kiddushin
type: NamedIndividual
type: Work
label: קידושין @he

Lamentations
type: NamedIndividual
type: Work

Leviticus
type: NamedIndividual
type: Work

Makkot
type: NamedIndividual
type: Work
label: מכות @he

Malachi
type: NamedIndividual
type: Work

Megillah
type: NamedIndividual
type: Work
label: מגילה @he

Meilah
type: NamedIndividual
type: Work
label: מעילה @he

Menachot
type: NamedIndividual
type: Work
label: מנחות @he

Micah
type: NamedIndividual
type: Work

Mishnah Berakhot
type: NamedIndividual
type: Work
label: משנה ברכות @he

Mishnah Bikkurim
type: NamedIndividual
type: Work
label: משנה ביכורים @he

Mishnah Challah
type: NamedIndividual
type: Work
label: משנה חלה @he

Mishnah Demai
type: NamedIndividual
type: Work
label: משנה דמאי @he

Mishnah Kilayim
type: NamedIndividual
type: Work
label: משנה כלאים @he

Mishnah Maaser Sheni
type: NamedIndividual
type: Work
label: משנה מעשר שני @he

Mishnah Maasrot
type: NamedIndividual
type: Work
label: משנה מעשרות @he

Mishnah Peah
type: NamedIndividual
type: Work
label: משנה פאה @he

Mishnah Shabbat
type: NamedIndividual
type: Work
label: משנה שבת @he

Mishnah Sheviit
type: NamedIndividual
type: Work
label: משנה שביעית @he

Mishnah Terumot
type: NamedIndividual
type: Work
label: משנה תרומות @he

Moshe ben Maimon: Mishneh Torah
type: NamedIndividual
type: Work

Moed Katan
type: NamedIndividual
type: Work
label: מועד קטן @he

Nahum
type: NamedIndividual
type: Work

Nazir
type: NamedIndividual
type: Work
label: נזיר @he

Nedarim
type: NamedIndividual
type: Work
label: נדרים @he

Nehemiah
type: NamedIndividual
type: Work

Niddah
type: NamedIndividual
type: Work
label: נדה @he

Numbers
type: NamedIndividual
type: Work

Obadiah
type: NamedIndividual
type: Work

Reuven Ṣarfati: Perush zulati
type: NamedIndividual
type: Work

Pesachim
type: NamedIndividual
type: Work
label: פסחים @he

Proverbs
type: NamedIndividual
type: Work

Psalms
type: NamedIndividual
type: Work

Joseph ben Shalom Ashkenazi: Commentary on the Sefer Yezirah
type: NamedIndividual
type: Work

Bahya ben Asher: Beur al ha-Torah
type: NamedIndividual
type: Work

Menachem Recanati: Commentary on the Torah
type: NamedIndividual
type: Work

Liber de Causis (Hebr.)
type: NamedIndividual
type: Work

Rosh Hashanah
type: NamedIndividual
type: Work
label: ראש השנה @he

Ruth
type: NamedIndividual
type: Work

Sanhedrin
type: NamedIndividual
type: Work
label: סנהדרין @he

Sefer ha-Bahir
type: NamedIndividual
type: Work

Shabbat
type: NamedIndividual
type: Work
label: שבת @he

Shemariah ben Elijah Ikriti of Negropont: Letter on the Creation of the World
type: NamedIndividual
type: Work

Shevu'ot
type: NamedIndividual
type: Work
label: שבועות @he

SongOfSongs
type: NamedIndividual
type: Work

Sukkah
type: NamedIndividual
type: Work
label: סוכה @he

Taanit
type: NamedIndividual
type: Work
label: תענית @he

Tamid
type: NamedIndividual
type: Work
label: תמיד @he

Temurah
type: NamedIndividual
type: Work
label: תמורה @he

Tractate Avadim
type: NamedIndividual
type: Work
label: מסכת עבדים @he

Tractate Derekh Eretz Rabbah
type: NamedIndividual
type: Work
label: מסכת דרך ארץ רבה @he

Tractate Derekh Eretz Zuta
type: NamedIndividual
type: Work
label: מסכת דרך ארץ זוטא @he

Tractate Gerim
type: NamedIndividual
type: Work
label: מסכת גרים @he

Tractate Kallah
type: NamedIndividual
type: Work
label: מסכת כלה @he

Tractate Kallah Rabbati
type: NamedIndividual
type: Work
label: מסכת כלה רבתי @he

Tractate Kutim
type: NamedIndividual
type: Work
label: מסכת כותים @he

Tractate Mezuzah
type: NamedIndividual
type: Work
label: מסכת מזוזה @he

Tractate Sefer Torah
type: NamedIndividual
type: Work
label: מסכת ספר תורה @he

Tractate Semachot
type: NamedIndividual
type: Work
label: מסכת שמחות @he

Tractate Soferim
type: NamedIndividual
type: Work
label: מסכת סופרים @he

Tractate Tefillin
type: NamedIndividual
type: Work
label: מסכת תפילין @he

Tractate Tzitzit
type: NamedIndividual
type: Work
label: מסכת ציצית @he

Yevamot
type: NamedIndividual
type: Work
label: יבמות @he

Yoma
type: NamedIndividual
type: Work
label: יומא @he

Zechariah
type: NamedIndividual
type: Work

Zephaniah
type: NamedIndividual
type: Work

Zevachim
type: NamedIndividual
type: Work
label: זבחים @he

Menachem Zioni: Ziyyuni
type: NamedIndividual
type: Work

Event
type: Class
comment: This class is part of the Ilanot manuscript description ontology

Manuscript
type: Class
comment: This class is part of the Ilanot manuscript description ontology

Maps of God Ontology
type: Ontology
abstract: An ontology to describe the content of manuscripts showing kabbalistic diagramms of the 10 Sefirot (Ilanot).
contributor: https://orcid.org/0000-0001-7890-1333
contributor: https://orcid.org/0000-0002-4041-6911
created: 2019-04-08T00:00:00Z
creator: https://orcid.org/0000-0003-3572-6170
creator: https://orcid.org/0000-0003-3626-4457
license: https://creativecommons.org/licenses/by/4.0/
modified: 2025-08-25T08:54:00Z
status: Draft
preferred namespace prefix: ilanot
preferred namespace uri: https://ilanot.org/voc/ontology#
version IRI: https://ilanot.org/voc/ontology/0.10.3
version info: 0.10.4 (2025-08-25)
change note: 2021-03-29 -- 0.9.6: minor corrections (typos, labels etc) 2021-03-30 -- 0.9.6: minor corrections (typos, labels etc) 2021-03-30 -- 0.9.7: added object property textgridAggregation and class TextGridAggregation 2021-03-30 -- 0.9.7: removed class 'Line' 2021-03-30 -- 0.9.7: added examples 2021-03-31 -- 0.9.8: revised definitions, added more examples, added metadata describing the ontology itself 2021-04-01 -- 0.9.8: added definitions, corrected metadata on the ontology itself 2021-04-06 -- 0.9.9: added Named Individuals for Works (Sources) 2021-04-09 -- 0.9.10: added annotations (variants and editorial comments) based on W3C Annotations Framework 2021-04-12 -- 0.9.10: corrected examples for ilanot:VariantItems and ilanot:missing 2021-04-13 -- 0.9.10: added textgrid: namespace and corrected IRI of Manuscript class 2021-04-14 -- 0.9.10: minor corrections to annotation properties 2021-04-21 -- 0.9.10 added prefix mapping for Manuscript Description Ontology@en . 2024-08-26 -- 0.9.11 removed classes 'Translation' and 'Transcription' (replaced by data properties), expanded sources list, added missing domains and ranges, added 'la' as possible comment language 2025-04-02 -- 0.10.0 added new map item subclasses, corrected some labels 2025-05-20 -- 0.10.1 added DigitalFacsimile, MapItem and Zone properties, Diagram etc. and Agent, fixed comments, fixed some labels/definitions, added Sources 2025-08-07 -- 0.10.2: minor corrections to labels and definitions 2025-08-18 -- 0.10.3: two more feature groups, restrictions for feature groups, typos 2025-08-25 -- 0.10.4: corrects of definitions/labels, one more feature class

Abba
type: Class
subclass of: Parẓuf
alternative label: Father
definition: Third of the six countenances (Parẓufim) of the highest World of Emanation (Aẓilut), it is the reconfiguration of the Sefirah Hokhmah and is in constant conjunction with the fourth countenance, Imma. It presents divine wisdom and fatherhood.
preferred label: אבא @he

Amateur Craftmansship
type: NamedIndividual
type: Aesthetic Characterization
definition: Expresses that a diagram was created with amateur craftmansship.

Colors
type: NamedIndividual
type: Aesthetic Characterization
definition: Expresses that a diagram includes colors.

Professional Craftmansship
type: NamedIndividual
type: Aesthetic Characterization
definition: Expresses that a diagram was created with professional craftmansship.

Volvelles
type: NamedIndividual
type: Aesthetic Characterization
definition: Expresses that a diagram includes volvelles.

Adam Kadmon
type: Class
subclass of: Parẓuf
alternative label: Primordial Adam
definition: Highest anthropomorphic expression of the divine. The primordial human-form containing all potential creation.
preferred label: אדם קדמון @he

Aesthetic Characterization
type: Class
definition: An aesthetic characteristic of a diagram, e.g. being in colors or showing a specific level of craftmansship.

Aether (Element)
type: Class
subclass of: Element
editorial note: added to complete the set of Empedoclean/Aristotelian elements
editorial note: definition missing
preferred label: אתר (יסוד) @he

Air (Element)
type: Class
subclass of: Element
editorial note: added to complete the set of Empedoclean elements
editorial note: definition missing
preferred label: רוח (יסוד) @he

Akudim
type: Class
subclass of: Worlds
alternative label: Bound Lights
definition: The first of three distinct stages in the emergence of the primordial Sefirot in which the Sefirot are Bound Lights
preferred label: עקודים @he

All-Encompassing Sphere
type: Class
subclass of: Feature
subclass of: Restriction
  on property: part of
  some values from: Cosmos
definition: Primum Mobile: the outermost moving sphere in the geocentric model of the universe
preferred label: גלגל המקיף @he

Altar
type: Class
subclass of: Feature
subclass of: Restriction
  on property: part of
  some values from: Temple
definition: Table used for making sacrifices in the Tabernacle and Jerusalem Temples
preferred label: מזבח @he

Angel
type: Class
subclass of: Feature
definition: Divine being belonging to the heavenly hierarchy
preferred label: מלאך @he

Aquarius
type: Class
subclass of: Astrological Sign
definition: The eleventh sign of the zodiac. The Sun transits this sign approximately between January 21 and February 20 each year. (see https://en.wikipedia.org/wiki/Aquarius_(astrology))
editorial note: check hebrew label
preferred label: דלי @he

Architecture
type: Class
subclass of: Decorative Element
definition: Architectural elements
preferred label: ארכיטקטורה @he

Area
type: Class
definition: A part of a manuscript's surface described by one or more sets of co-ordinates (Lines). (An Area may have "holes" in it)
editorial note: blank node should nevertheless contain an rdf:type statement
example: # In the Maps of God portal, an Area is represented by a blank node item:region_5c0773bc-ac03-4059-a5d2-8693cafe154d a ilanot:Zone ; ontology:hasArea [ a ilanot:Area ; ilanot:hasCoordinates "<svg:polygon>...</svg:polygon>"^^rdf:XMLLiteral ; ilanot:hasSize "0.000935030400012648"^^xsd:double ; ilanot:isLocatedOn item:surface3vr9 ] .

Aries
type: Class
subclass of: Astrological Sign
definition: The first astrological sign in the zodiac. The Sun transits this sign between approximately March 20 and April 21 each year. (see https://en.wikipedia.org/wiki/Aries_(astrology))
editorial note: check hebrew label
preferred label: טלה @he

Arikh Anpin
type: Class
subclass of: Parẓuf
alternative label: Long Face
alternative label: Makroprosopos
alternative label: Patient
definition: Second of the six countenances (Parẓufim) of the highest World of Emanation (Aẓilut), it is the outer dimension of Keter and considered the first emanated entity, channeling primary divine will.
preferred label: אריך אנפין @he

Ark of the Covenant
type: Class
creator: http://orcid.org/0000-0003-3572-6170
date: 2020-11-13T15:57:59Z
subclass of: Feature
subclass of: Restriction
  on property: part of
  some values from: Temple
definition: A gold-covered chest of acacia wood containing the two stone tablets of the Ten Commandments mentioned in the Book of Exodus. @he
preferred label: ארון הברית @he

Assiyah
type: Class
subclass of: Worlds
alternative label: World of Action
definition: World of Action - the fourth and lowest of the four kabbalistic worlds
preferred label: עולם העשיה @he

Atik Yomin
type: Class
subclass of: Parẓuf
alternative label: Ancient of Days
definition: First of the six countenances (Parẓufim) of the highest World of Emanation (Aẓilut), it is the inner dimension of Keter connecting Ein Sof to creation and considered the lowest expression of the primordial emanating divinity.
preferred label: עתיק יומין @he

Atika Kadisha
type: Class
subclass of: Parẓuf
alternative label: Holy Ancient One
definition: The highest aspect of Arikh Anpin concealed within Keter.
preferred label: עתיקא קדישא @he

13 Enhancements of the Beard (13 Attributes of Mercy)
type: Class
subclass of: Feature
definition: Divine attributes enumerated in Exodus 34:6-7; Micah 7:18
preferred label: י"ג תיקוני דיקנא (י"ג מידות הרחמים) @he

Aẓilut
type: Class
subclass of: Worlds
alternative label: World of Emanation
definition: World of Emanation - the first and highest of the four kabbalistic worlds
preferred label: עולם האצילות @he

Beard
type: Class
subclass of: Body Part
definition: The beard of Arikh Anpin corresponds to the thirteen attributes of compassion.
preferred label: זקן @he

Beast
type: Class
subclass of: Decorative Element
definition: Wild animal
preferred label: חיה @he

Beriah
type: Class
subclass of: Worlds
alternative label: World of Creation
definition: World of Creation - the second of the four kabbalistic worlds
preferred label: עולם הבריאה @he

Biblical Figure
type: Class
subclass of: Feature
definition: A character from the bible.
preferred label: דמות מקראית @he

Bilhah
type: Class
subclass of: Parẓuf
alternative label: Bilha
definition: The external aspect of Rachel serving to elevate lower realms
preferred label: בלהה @he

Binah
type: Class
subclass of: Sefirah
subclass of: Restriction
  on property: part of
  some values from: Upper Sefirot
alternative label: Understanding
definition: The third of the ten Sefirot
preferred label: בינה @he

Bird
type: Class
subclass of: Decorative Element
definition: Feathered flying creature
preferred label: ציפור @he

Body Part
type: Class
subclass of: Feature
editorial note: definition missing
preferred label: איבר @he

Brain
type: Class
subclass of: Body Part
definition: The divine 'brain' or conceptual realm within each Parẓuf.
preferred label: מוחא @he

Brudim
type: Class
subclass of: Worlds
alternative label: Spotted Lights
definition: The third of three distinct stages in the emergence of the primordial Sefirot in which the Sefirot are in a state of separation, but each is also included within the all the others.
preferred label: ברודים @he

Calligraphy
type: Class
subclass of: Decorative Element
definition: Decorative handwriting
preferred label: קליגרפיה @he

Cancer
type: Class
subclass of: Astrological Sign
definition: The fourth astrological sign in the zodiac. The Sun transists this sign approximately between June 22 and July 22 each year (see https://en.wikipedia.org/wiki/Cancer_(astrology))
editorial note: check hebrew label
preferred label: סרטן @he

Capricorn
type: Class
subclass of: Astrological Sign
definition: The tenth astrological sign of the zodiac. The Sun transtis this sign approximately between Deceber 21 and January 21 each year. (see https://en.wikipedia.org/wiki/Capricorn_(astrology))
editorial note: check hebrew label
preferred label: גדי @he

Heavens
type: Class
subclass of: Feature
subclass of: Restriction
  on property: part of
  some values from: Cosmos
definition: Celestial planetary spheres and fixed stars
preferred label: שמים @he

Chariot
type: Class
subclass of: Feature
definition: The collection of the items described in the vision of the biblical prophet Ezekiel (Ez. 1 and Ez. 10)
preferred label: מרכבה @he

Chariot Axis
type: Class
subclass of: Feature
definition: The collection of the items described in the vision of the biblical prophet Ezekiel (Ez. 1 and Ez. 10)
editorial note: definition missing
preferred label: ציר המרכבה @he

Chariot Beast
type: Class
subclass of: Feature
alternative label: Cherub
definition: One of the four four-faced creatures described as carriers of the Chariot described in the vision of the biblical prophet Ezekiel (Ez. 1 and Ez. 10)
preferred label: חיית המרכבה @he

Chariot Wheel
type: Class
subclass of: Feature
definition: The wheels beside the beasts of the chariot, as described in Ezekiel 1.15-17.
example: https://dev.ilanot.org/detail#5.000/-274.953/82.047
preferred label: גלגל המרכבה @he

Cheeks
type: Class
subclass of: Body Part
definition: The 'cheeks' representing aspects of divine will's manifestation.
preferred label: לחיים @he

Cherub
type: Class
subclass of: Decorative Angel
definition: Winged celestial being
preferred label: כרוב @he

Chest
type: Class
subclass of: Body Part
definition: The divine 'chest' representing the point of transition in each Parẓuf.
preferred label: חזה @he

Cloud
type: Class
subclass of: Feature
editorial note: definition missing
example: https://dev.ilanot.org/detail#5.000/-33.469/117.859
preferred label: ענן @he

Colors
type: Class
subclass of: Feature
definition: Symbolic colors.
preferred label: צבעים @he

Connecting Line
type: Class
subclass of: Feature
definition: A line emphasizing the connection between an object and a related text.
example: https://dev.ilanot.org/detail#1/-27/113
preferred label: קו מקשר @he

Content
type: Class
definition: The textual or figurative content that together with the designation of an area on the manuscript's surface constitutes a Zone. This could be the actual (Hebrew) text, the translation and possible comments/annotations (or a reference to figurative content (e.g. an iconclass notation). Needs to link to the text items in the TEI files (e.g. hasText, hasTranslation, hasComment etc).
example: # In the Maps of God portal, a "Content" block is represented by a blank node item:region_5c0773bc-ac03-4059-a5d2-8693cafe154d a ilanot:Zone ; ilanot:hasContent [ ilanot:hasTranscription " ... "^^rdf:XMLLiteral ; ilanot:hasTranslation " ... "^^rdf:XMLLiteral ] .

Context
type: Class
definition: The historical context in which a diagram was produced to be used, e.g. as amulet, for prayer or for hermeneutical purposes.

Amulet or Magical
type: NamedIndividual
type: Context
definition: Expresses that the usage context of a diagram is as an amulet or for other magical purposes.

Hermeneutical
type: NamedIndividual
type: Context
definition: Expresses that the usage context of a diagram is for hermeneutical purposes.

Prayer
type: NamedIndividual
type: Context
definition: Expresses that the usage context of a diagram is for prayer.

Cosmos
type: Class
subclass of: Feature
definition: The (theological concept of the) created universe, heaven and earth
preferred label: קוסמוס @he

Crown
type: Class
subclass of: Feature
definition: The highest sefirah.
preferred label: כתרא @he

Daat
type: Class
subclass of: Sefirah
alternative label: Knowledge
definition: A posited Sefirah between the third and forth Sefirot, or the third according to those who do not count the first among the ten
preferred label: דעת @he

Decorative Angel
type: Class
subclass of: Decorative Element
definition: An artistic decorative angel
preferred label: מלאך דקורטיבי @he

Decorative Crown
type: Class
subclass of: Decorative Element
definition: Royal head ornament
preferred label: כתר דקורטיבי @he

Decorative Element
type: Class
subclass of: Map Item
definition: Any item on the map that in itself does not convey meaning but serves solely decorative or ornamental purposes
preferred label: מרכיב דקורטיבי @he

Decorative Temple/Tabernacle Vessels
type: Class
subclass of: Decorative Element
definition: The vessels of the Temple/Tabernacle purely for decoration
preferred label: כלי המקדש דקורטיביים @he

Demon
type: Class
subclass of: Feature
definition: An (individual) evil spirit
preferred label: שד @he

Descriptive Element
type: Class
subclass of: Map Item
definition: Any element on the map that conveys meaning or information but is not a feature
preferred label: מרכיב תיאורי @he

Diadem of Yesod
type: Class
subclass of: Crown
definition: The crown of the procreative divine power channeling influence.
preferred label: עטרת היסוד @he

Diagram
type: Class
definition: A kabbalistic diagram which corresponds to a (potential) edition in the Ilanot project.

Diagrammatic Element E
type: Class
subclass of: DiagrammaticElement
definition: The Diagrammatic Element called The Thirteen Enhancements of the Beard.

Diagrammatic Element T
type: Class
subclass of: DiagrammaticElement
definition: The Diagrammatic Element called Temerles Tree.

Diagrammatic Element V
type: Class
subclass of: DiagrammaticElement
definition: The Diagrammatic Element called The Grand Circles of Vital.

Diagrammatic Element W
type: Class
subclass of: DiagrammaticElementW-like
definition: The standard version of the Diagrammatic Element called Trees of the Worlds.

Diagrammatic Element Wy
type: Class
subclass of: DiagrammaticElementW-like
definition: A version of the Diagrammatic Element called Trees of the Worlds that ends with Yeẓira.

Digital Facsimile
type: Class
definition: A digital image of a manuscript's surface, a printed sheet or a book's page.

Ear
type: Class
subclass of: Body Part
definition: The divine 'ear' receiving and processing prayers and judgments
preferred label: אוזן @he

Earth (Element)
type: Class
subclass of: Element
editorial note: added to complete the set of Empedoclean elements
editorial note: definition missing
preferred label: אדמה (יסוד) @he

Gan Eden
type: Class
subclass of: Feature
alternative label: Garden of Eden
definition: The divinely planted garden described in Genesis 2:8-9 etc.
preferred label: גן עדן @he

Editorial Comment
type: Class
creator: http://orcid.org/0000-0003-3572-6170
date: 2021-04-09T07:29:59Z
subclass of: Annotation
definition: An annotation of a single instance or a group of instances of ilanot:MapItem, giving any additional scholarly insight or consideration. The target of this annotation may be a single map item (feature, descriptive or decorative element), a set of individual map items (oa:Independents) or a composite group (oa:Composite), depending on whether the comment applies to a single item only, to each item of a group individually or to a group of items as a whole. Comments on variant items on different manuscripts/surface should be made using ilanot:VariantItems, Identification of Sources and Topics should not be made using annotations at all, but should be statements on the content (ilanot:Content and subclasses) of a zone.
example: example:Annotation6 a ilanot:EditorialComment ; oa:hasBody [ a oa:TextualBody ; rdf:value " Any editorial comment here... " ; dc:language "en"; dc:format "application/tei+xml". ] ; oa:hasTarget [ a oa:Independents ; as:items ( item:mapitem_12345 item:mapitem_98765 ) . ]

Egg/Testicle
type: Class
subclass of: Body Part
definition: The cosmic 'egg' containing primordial potential.
preferred label: ביעא @he

Element
type: Class
subclass of: Feature
subclass of: Restriction
  on property: part of
  some values from: Cosmos
definition: One of the four classical elements established by Empedocles including earth, water, air, and fire; Aristotle's fifth element of aether is sometimes added
preferred label: יסוד @he

Eyn Sof
type: Class
subclass of: Feature
subclass of: Restriction
  on property: part of
  some values from: Ilan
alternative label: En Sof
alternative label: Infinite
alternative label: No End
definition: The limitless, unknowable divine essence that precedes all emanation.
preferred label: אין סוף @he

Eye
type: Class
subclass of: Body Part
alternative label: 'ayin
definition: The divine 'eye' of providence and supervision.
preferred label: עין @he

Family
type: Class
definition: A family of diagrams which can be grouped together by assumed historical relation.

Feature
type: Class
subclass of: Map Item
definition: Any abstraction of phenomena existing in the space the Ilan manuscript depicts represented by graphical or textual means in the manuscript. It is of no bearing if the space represented by the Ilan manuscript is understood as a physical space or as a space metaphor used as a means to describe abstract concepts
editorial note: Hebrew Label uncertain
preferred label: מרכיב @he

Festivals
type: Class
subclass of: Feature
definition: Jewish holidays.
preferred label: שמות המועדים @he

Figurative Content
type: Class
subclass of: Content
definition: An abstaction of a zone's content which is not textual content

Fire (Element)
type: Class
subclass of: Element
definition: The fourth of the classical elements established by Empedocles
preferred label: אש (יסוד) @he

Firmament
type: Class
subclass of: Feature
subclass of: Restriction
  on property: part of
  some values from: Cosmos
definition: Biblical heaven
preferred label: רקיע @he

Floral Ornament
type: Class
subclass of: Decorative Element
definition: An ornament in the shape of a plant or parts thereof (leaves, petals etc)
preferred label: קישוט פרחוני @he

Foot/Leg
type: Class
subclass of: Body Part
definition: The divine 'foot' representing descent of influence to lower realms
preferred label: רגל @he

Forehead
type: Class
subclass of: Body Part
definition: The divine 'forehead' revealing concealed will.
preferred label: מצח @he

Fortress
type: Class
subclass of: Feature
editorial note: definition missing
preferred label: מבצר @he

Four Sages who Entered Pardes
type: Class
subclass of: Feature
definition: Rabbis of antiquity, who according to a narrative told in the Tosefta (Hagigah 2:2)) and the Babylonian (Hagigah 14b) and Jeruasalem Talmud (Hagigah 2:1), entered the paradies (cf. https://en.wikipedia.org/wiki/Pardes_(legend))
preferred label: ארבעה שנכנסו לפרדס @he

Gate
type: Class
subclass of: Feature
definition: Opening between cosmological levels
preferred label: שער @he

Gemini
type: Class
subclass of: Astrological Sign
definition: The third astrological sign of the zodiac. The Sun transits this sign between May 21 and June 21 each year. (see https://en.wikipedia.org/wiki/Gemini_(astrology))
editorial note: check hebrew label
preferred label: תאומים @he

Gevurah
type: Class
subclass of: Sefirah
subclass of: Restriction
  on property: part of
  some values from: Lower Sefirot
alternative label: Discernment
definition: The fifth of the ten Sefirot
preferred label: גבורה @he

Group
type: Class
subclass of: Map Item
definition: Any meaningful grouping of two or more Map Items.

Hair
type: Class
subclass of: Body Part
definition: Thirteen strands on either side of the face of Arikh Anpin, described by Vital as the peot (sidelocks) conduits by which the 'waters' of the 'great sea of Ḥokhmah of the concealed brain' flow downward.
preferred label: שיער @he

Hand/Arm
type: Class
subclass of: Body Part
definition: The divine 'hand' - active implementation of will.
preferred label: יד @he

Hashmal
type: Class
subclass of: Feature
definition: A shining substance, amber or electrum or bronze; from Ezekiel 1: 4, 27
preferred label: חשמל @he

Head
type: Class
subclass of: Body Part
definition: The top three Sefirot within Malkhut of Adam Kadmon; also referred to as 'Atik'.
preferred label: ראש @he

Heart
type: Class
subclass of: Body Part
definition: An illustration of the gematric value of thirty-two paths of wisdom.
example: https://dev.ilanot.org/detail#1/-27/113
preferred label: לב @he

Ḥesed
type: Class
subclass of: Sefirah
subclass of: Restriction
  on property: part of
  some values from: Lower Sefirot
alternative label: Compassion
alternative label: Love
definition: The fourth of the ten Sefirot
preferred label: חסד @he

Hidden Names
type: Class
subclass of: Holy Name
definition: Concealed divine names
preferred label: שמות הנעלמים @he

Hitlabshut
type: Class
subclass of: Feature
alternative label: Enrobing
definition: The process of one Parẓuf 'clothing' itself within another.
preferred label: התלבשות @he

Hod
type: Class
subclass of: Sefirah
subclass of: Restriction
  on property: part of
  some values from: Lower Sefirot
alternative label: Splendor
definition: The eighth of the ten Sefirot
preferred label: הוד @he

Ḥokhmah
type: Class
subclass of: Sefirah
subclass of: Restriction
  on property: part of
  some values from: Upper Sefirot
alternative label: Wisdom
definition: The second of the ten Sefirot
preferred label: חכמה @he

Holy Name
type: Class
subclass of: Feature
definition: Proper nouns associated with divinity
preferred label: שם קדוש @he

Holy Temple
type: Class
subclass of: Decorative Element
definition: The Holy Temple of Jerusalem, depicted for decorative purposes
preferred label: בית המקדש @he

Human Figure
type: Class
subclass of: Decorative Element
definition: Generic human figure as ornamental content of a manuscript. If the depicted figure is not ornamental but bears meaning, an appropriate sub-class from the class "Feature" (for example "Sage") must be used instead. This class must also not be used if any feature or combination of features are represented in a human shape (e.g. an Ilan). In this case use the hasShape property with the appropriate value.
preferred label: דמות אנושית @he

Human Breasts
type: Class
subclass of: Body Part
definition: The human-form 'breasts' channeling refined divine sustenance.
preferred label: דדי אדם @he

Ilan
type: Class
subclass of: Feature
definition: Arboreal Schema
editorial note: is the definition sufficient?
preferred label: אילן @he

Pirkei Ha-Ẓelem
type: Class
subclass of: Feature
definition: The entirety of the calibrated Shefa that is given to Zeir Anpin.
preferred label: פרקי הצלם @he

Imma
type: Class
subclass of: Parẓuf
alternative label: Mother
definition: Fourth of the six countenances (Parẓufim) of the highest World of Emanation (Aẓilut), it is the reconfiguration of the Sefirah Binah and represents divine understanding and motherhood.
preferred label: אמא @he

Intellect
type: Class
subclass of: Feature
subclass of: Restriction
  on property: part of
  some values from: Cosmos
definition: Intellect; positioned cosmologically in the philosophical tradition beyond the planetary orbs
preferred label: שכל @he

Israel Saba
type: Class
subclass of: Parẓuf
alternative label: Grandfather Israel
definition: A subdivision of the countenances (Parẓufim) of Abba and Imma. The Parẓuf mediating between divine wisdom and smaller configurations.
preferred label: ישראל סבא @he

Jerusalem
type: Class
subclass of: Feature
definition: The holy city Jerusalem.
preferred label: ירושלים @he

Jupiter (Planet)
type: Class
subclass of: Planet
editorial note: check hebrew label
editorial note: definition missing
preferred label: צדק @he

Kavei Yaḥas
type: Class
subclass of: Feature
definition: Graphical indications of the nodes that serve as sites for the enrobing (hitlabshut) process.
preferred label: קווי יחס @he

Kebar River
type: Class
subclass of: Feature
editorial note: definition missing
example: https://dev.ilanot.org/detail#4.00/-265.92/54.06
preferred label: קווי יחס @he

Keter
type: Class
subclass of: Sefirah
subclass of: Restriction
  on property: part of
  some values from: Upper Sefirot
alternative label: Crown
definition: The first of the ten Sefirot
preferred label: כתר @he

Keter and Eyn Sof
type: Class
subclass of: FeatureGroup
subclass of: Restriction
  on property:
    inverse of: part of
  some values from: Eyn Sof
subclass of: Restriction
  on property:
    inverse of: part of
  some values from: Keter
example: https://www.nli.org.il/he/manuscripts/NNL_ALEPH990001040920205171/NLI#$FL30961039
preferred label: כתר ואין סוף @he

Keter, Ḥokhmah and Binah
type: Class
subclass of: FeatureGroup
subclass of: Restriction
  on property:
    inverse of: part of
  some values from: Binah
subclass of: Restriction
  on property:
    inverse of: part of
  some values from: Hokhmah
subclass of: Restriction
  on property:
    inverse of: part of
  some values from: Keter
preferred label: כתר, חכמה ובינה @he

Klippot
type: Class
subclass of: Feature
alternative label: Shells
definition: Evil spiritual forces
preferred label: קליפות @he

Label
type: Class
subclass of: Descriptive Element
definition: A text element that identifies ("labels") a feature by one or not more than a few words. "Identifies" in the definition is to be understood as opposed to "explains" or "discusses". If the feature is represented by a word alone (e.g. a Holy Name) that word is not a label but a representation of the feature.
editorial note: Hebrew label missing
preferred label: תג @he

Ladder
type: Class
subclass of: Feature
alternative label: Jacob's Ladder
alternative label: סולם יעקב @he
definition: The ladder in the dream of the patriach Jacob described in Genesis 28:10-19
example: https://dev.ilanot.org/detail#1/-27/113
preferred label: סולם @he

Leah
type: Class
subclass of: Parẓuf
definition: A feminine Parẓuf emerging behind Ze'ir Anpin upper body, with affinity to Imma. The Parẓuf Zeir Anpin can be subdivided into upper and lower dimensions; Leah is its upper aspect.
preferred label: לאה @he

Leo
type: Class
subclass of: Astrological Sign
definition: The fifth astrological sign of the zodiac. The sun transits this sign approximately between July 23 and August 22 each year. (see https://en.wikipedia.org/wiki/Leo_(astrology))
editorial note: check hebrew label
preferred label: אריה @he

Libra
type: Class
subclass of: Astrological Sign
definition: The seventh sign in the zodiac. The Sun transits this sign approximately between September 23 and October 22 each year. (see https://en.wikipedia.org/wiki/Libra_(astrology))
editorial note: check hebrew label
preferred label: מאזניים @he

Beor Pnei Melekh Hayyim
type: Class
subclass of: Feature
definition: The light in front of the face of Zeir Anpin (based on Proverbs 16:15).
preferred label: באור פני מלך חיים @he

Breath Streaming From Yesod
type: Class
subclass of: Feature
definition: The 'breath' emanating from the divine procreative force.
preferred label: הבל היוצא מיסוד @he

Lilith
type: Class
subclass of: Demon
definition: The female leader of the demons
preferred label: לילית @he

Lower Mustache
type: Class
subclass of: Body Part
definition: The upper 'lip' channeling specific aspects of divine judgment
preferred label: שפם עליון @he

Lower Sefirot
type: Class
subclass of: Feature
subclass of: Restriction
  on property: part of
  some values from: Ilan
definition: Hesed, Geburah, Tiferet, Hod, Nezaḥ, Yesod and Malkhut as a group of Sefirot being part of an ilan
preferred label: ספירות תחתונות @he

Malbush
type: Class
subclass of: Feature
alternative label: Garment
definition: The 'garment' that constricts divine light for transmission.
preferred label: מלבוש @he

Malkhut
type: Class
subclass of: Sefirah
subclass of: Restriction
  on property: part of
  some values from: Lower Sefirot
alternative label: Kingdom
definition: The tenth of the ten Sefirot
preferred label: מלכות @he

Map Item
type: Class
definition: Any content item that is found on an ilanot manuscript. In this context "content" means what the items on the manuscript "are" or "represent" (e.g. the item 'is' a sefira or 'is' a text block), which is to be distinguished from the class "Content" which represents the textual or pictorial content of a zone.
example: item:mapitem_7f30d23a-f3ee-47b6-eeb6-5fe370b7ff15 a ilanot:HolyName ; ilanot:hasZone item:region_66074c57-1169-4e76-9469-727da69b14c4 ; ilanot:isContinuedBy item:mapitem_e253fd52-f8e8-4141-abaf-b36ea69aada2 ; ilanot:partOf item:mapitem_d7ab3ef6-11e2-4aa8-cc6c-9523489d9ce0 .

Mars (Planet)
type: Class
subclass of: Planet
editorial note: check hebrew label
editorial note: definition missing
preferred label: מאדים @he

Mask
type: Class
subclass of: Decorative Element
definition: Face covering
preferred label: מסכה @he

Membrane
type: Class
subclass of: Body Part
definition: The membrane that contains and channels divine intellectual force.
preferred label: קרומא @he

Menorah
type: Class
subclass of: Feature
subclass of: Restriction
  on property: part of
  some values from: Temple
alternative label: Candelabrum
definition: Seven-branched candelabrum used for lighting in the Tabernacle and Jerusalem Temples
preferred label: מנורה @he

Mercury (Planet)
type: Class
subclass of: Planet
editorial note: check hebrew label
editorial note: definition missing
preferred label: כוכב חמה @he

Metatron
type: Class
subclass of: Angel
definition: Post-biblical archangel often referred to as the "Minister of the [Divine] Face" and regarded in Jewish esoteric traditions as the apotheosis of the biblical Enoch
preferred label: מטטרון @he

Module K
type: Class
subclass of: Module
definition: The Configuration found in Knorr's Saruqian ilan (Kabbala Denudata, figs. 8-11).

Module N
type: Class
subclass of: Module
definition: The Configuration found in the Ilan of Expanded Names (Kabbala Denudata, fig. 15).

Module P
type: Class
subclass of: ModuleP-like
definition: The Configuration found in the Ilan of Adam Kadmon and the Enrobings (Kabbala Denudata, figs. 1-7).

Module P7
type: Class
subclass of: ModuleP-like
definition: The continuation of Module P from where Pa left off to the end of the section corresponding to Kabbala Denudata, fig. 7, ending with 'Jerusalem'.

Module Pa
type: Class
subclass of: ModuleP-like
definition: An abridged version of the Configuration found in the Ilan of Adam Kadmon and the Enrobings up to the head of Arikh (Kabbala Denudata, fig. 1 and the top of 2).

Module Pr
type: Class
subclass of: ModuleP-like
definition: A corrupt structure version of the Configuration found in the Ilan of Adam Kadmon and the Enrobings (Kabbala Denudata, figs. 1-7), with the section corresponding to figs 6-7 having been spliced into the section corresponding to fig. 3.

Module Pu
type: Class
subclass of: ModuleP-like
definition: A single-column redesign of the Configuration found in the Ilan of Adam Kadmon and the Enrobings (Kabbala Denudata, figs. 1-7).

Module Z
type: Class
subclass of: ModuleZ-like
definition: The Configuration found in the Arikh and the Enrobings Ilan by Zacuto and Ẓemaḥ (represented in Kabbala Denudata, figs. 13-14).

Module Z13
type: Class
subclass of: ModuleZ-like
definition: The Configuration found in the Arikh diagram by Zacuto (represented in Kabbala Denudata, fig. 13).

Module Z14
type: Class
subclass of: ModuleZ-like
definition: The Configuration found in the Enrobings diagram by Ẓemaḥ (represented in Kabbala Denudata, fig. 14).

Moon (Planet)
type: Class
subclass of: Planet
editorial note: check hebrew label
editorial note: definition missing
preferred label: ירח @he

Mouth
type: Class
subclass of: Body Part
definition: The divine 'mouth' representing creative speech and revelation.
preferred label: פה @he

Navel
type: Class
subclass of: Body Part
definition: The 'navel' point where divine energy is concentrated and redistributed.
preferred label: טבור @he

Nekudim
type: Class
subclass of: Worlds
alternative label: Speckled Lights
definition: The second of three distinct stages in the emergence of the primordial Sefirot in which the Sefirot become separated into distinct aspects that are not included within each other.
preferred label: נקודים @he

Neshama
type: Class
subclass of: Soul
definition: A term used in ancient (biblical and rabbinic) sources to denote a human or the life force, but which, in medieval and later sources denotes one (high) level of the multipartite human soul. In tripartite systems, it is the highest of the three, above Nefesh and Ruaḥ
preferred label: נשמה @he

Neẓaḥ
type: Class
subclass of: Sefirah
subclass of: Restriction
  on property: part of
  some values from: Lower Sefirot
alternative label: Endurance
alternative label: Victory
definition: The seventh of the ten Sefirot
preferred label: נצח @he

Neẓaḥ and Hod
type: Class
subclass of: FeatureGroup
subclass of: Restriction
  on property:
    inverse of: part of
  some values from: Hod
subclass of: Restriction
  on property:
    inverse of: part of
  some values from: Neẓaḥ
preferred label: נצח והוד @he

Nezaḥ, Hod and Yesod
type: Class
subclass of: FeatureGroup
subclass of: Restriction
  on property:
    inverse of: part of
  some values from: Hod
subclass of: Restriction
  on property:
    inverse of: part of
  some values from: Neẓaḥ
subclass of: Restriction
  on property:
    inverse of: part of
  some values from: Yesod
preferred label: נצח, הוד ויסוד @he

9 Enhancements of the Beard
type: Class
subclass of: Feature
definition: Zeir Anpin's beard enhancements, corresponding to the divine attributes enumerated in Numbers 14:18.
preferred label: ט' תיקוני דיקנא @he

Nose
type: Class
subclass of: Body Part
definition: The divine 'nose' channeling anger and forgiveness.
preferred label: חוטם @he

Nukba
type: Class
subclass of: Parẓuf
alternative label: Female
definition: The general term for feminine Parẓufim receiving from their male counterparts. Final countenance (Parẓuf) of the highest World of Emanation (Aẓilut), it is the reconfiguration of the Sefirah Malkhut.
preferred label: נוקבא @he

Worlds
type: Class
subclass of: Feature
definition: four primary emanated realms
editorial note: revise definition, this class lists already six sub-classes
editorial note: should rather be singular (in both English and Hebrew)
preferred label: עולמות @he

Palace
type: Class
subclass of: Feature
alternative label: Heikhal
editorial note: A spiritual hall-like domain
preferred label: היכל @he

Palm of Hand
type: Class
subclass of: Decorative Element
definition: An ornament in the shape of the palm of a human hand
preferred label: כף יד @he

Parsa
type: Class
subclass of: Partition
definition: Lurianic intradivine partition
preferred label: פרסה @he

Partition
type: Class
subclass of: Feature
definition: Dividing element separating or distinguishing cosmological realms
editorial note: While the definition of this class speaks about "cosmological" partitions/divisions, the subclasses describe partitions/divisions within the divine
preferred label: מסך @he

Parẓuf
type: Class
subclass of: Feature
alternative label: Countenance
definition: Expression of divinity (configuration of Sefirot) emanated from Adam Kadmon
preferred label: פרצוף @he

32 Paths of Wisdom
type: Class
subclass of: Feature
editorial note: Thirty-two paths of divine wisdom, linked to the 32 names of Elohim in Genesis 1
preferred label: 32 נתיבות חכמה @he

Pisces
type: Class
subclass of: Astrological Sign
definition: The twelfth astrological sign of the zodiac. The sun transits this sign approximately between February 19 and March 20 each year. (see https://en.wikipedia.org/wiki/Pisces_(astrology))
editorial note: check hebrew label
preferred label: דגים @he

Planet
type: Class
subclass of: Feature
alternative label: Celestial Body
definition: Celestial Body according to Ptolemaic model of the world
editorial note: check hebrew label
preferred label: כוכב לכת @he

Planetary Sphere
type: Class
subclass of: Feature
subclass of: Restriction
  on property: part of
  some values from: Planetary Orbs
alternative label: Planetary Orb
editorial note: definition missing
editorial note: hebrew label missing

Planetary Orbs
type: Class
subclass of: Feature
subclass of: Restriction
  on property: part of
  some values from: Cosmos
definition: The Ptolemaic geocentric model of the universe in classical, medieval, and renaissance astronomy
preferred label: גלגלים @he

Pointing Finger
type: Class
subclass of: Body Part
alternative label: Manicule
definition: An illustration indicating the connection between an object and a textblock.
example: https://dev.ilanot.org/detail#4.00/-71.16/99.14
preferred label: אצבע מורה @he

Praying Hands
type: Class
subclass of: Body Part
definition: Hands used to illustrate prayer.
editorial note: hebrew label missing
example: https://dev.ilanot.org/detail#1/-68/110

Psalm 67 Menorah
type: Class
subclass of: Decorative Element
definition: Psalm 67 calligraphically designed as a Menorah
preferred label: מנורה - מזמור סז @he

Putto
type: Class
subclass of: Decorative Angel
definition: An angelic figure depicted as a chubby, winged male child
preferred label: פוטו @he

Rabbi Akiva
type: Class
subclass of: Sage
subclass of: Restriction
  on property: part of
  some values from: Four Sages who Entered Pardes
definition: Second-century leading rabbinic sage
preferred label: רבי עקיבא @he

Raḥel
type: Class
subclass of: Parẓuf
alternative label: Rachel
definition: The Parẓuf Nukba can be subdivided into upper and lower dimensions; Rachel is its lower aspect. This main feminine Parẓuf stands back-to-back with Ze’ir Anpin.
preferred label: רחל @he

Rainbow
type: Class
subclass of: Feature
subclass of: Restriction
  on property: part of
  some values from: Cosmos
definition: A spectrum of light appearing in the sky in the form of a multicoloured circular arc, commonly regarded in Jewish esoteric sources as a revelation of the Divine Glory and sign of the Covenant.
preferred label: קשת @he

Ribbon
type: Class
subclass of: Decorative Element
definition: Decorative strip of fabric
preferred label: סרט @he

Ruaḥ
type: Class
subclass of: Soul
editorial note: definition missing
preferred label: רוח @he

Sabbatean Element
type: Class
subclass of: Feature
definition: An elements from the Sabbatean kabbalah.
preferred label: מרכיב שבתאי @he

Sage
type: Class
subclass of: Feature
definition: A rabbi
editorial note: Hebr. label singular or plural?
preferred label: חכמים @he

Sagittarius
type: Class
subclass of: Astrological Sign
definition: The ninth sign of the zodiac. The Sun transits this sign approximately between November 23 and December 21. (see https://en.wikipedia.org/wiki/Sagittarius_(astrology))
editorial note: check hebrew label
preferred label: קשת @he

Samael
type: Class
subclass of: Demon
definition: The male leader of the demons
preferred label: סמאל @he

Sandalfon
type: Class
subclass of: Angel
editorial note: definition missing
preferred label: סנדלפון @he

Saruqian Element
type: Class
subclass of: Feature
definition: An element from the Saruqian kabbalah.
preferred label: מרכיב סרוקי @he

Saturn (Planet)
type: Class
subclass of: Planet
editorial note: check hebrew label
editorial note: definition missing
preferred label: שבתאי @he

Scorpio
type: Class
subclass of: Astrological Sign
definition: The eitgth sign of the zodiac. The Sun transits this sign approximately between October 23 and November 22. (see https://en.wikipedia.org/wiki/Scorpio_(astrology))
editorial note: check hebrew label
preferred label: עקרב @he

Appellations from Sefer Yezirah
type: Class
subclass of: Holy Name
definition: Appellations from Sefer Yezirah.
preferred label: כינויים מספר יצירה @he

Sefer Yezirah Element
type: Class
subclass of: Feature
definition: An element from Sefer Yezirah.
preferred label: אלמנט מספר יצירה @he

Sefirah
type: Class
subclass of: Feature
subclass of: Restriction
  on property: part of
  some values from: Ilan
disjoint with: Channel
alternative label: Iggul
alternative label: עיגול @he
definition: A hypostatic divine emanation.
preferred label: ספירה @he

Serpent
type: Class
subclass of: Feature
subclass of: Restriction
  on property: part of
  some values from: Ilan
definition: A figure that symbolises demonic/evil qualities in connection with a specific sefira of an ilanot. Could be represented as a serpent or a dragon
preferred label: נחש @he

Shape
type: Class
definition: An abstraction of the visual appearance of a Map Item, describing its geometrical form or a real-word item it resembles. A shape is assigned intellecutally and based on the visual appearance not derived from the geometry of the zones constituing the Map Item in question.

Abundance
type: Class
subclass of: Feature
alternative label: Shefa
editorial note: definition missing
preferred label: שפע @he

Shewbread Table
type: Class
subclass of: Feature
subclass of: Restriction
  on property: part of
  some values from: Temple
alternative label: Table
editorial note: definition missing
preferred label: שולחן @he

Shoulder
type: Class
subclass of: Body Part
definition: The divine 'shoulder' channeling severity and judgment.
preferred label: כתף @he

Sidelocks
type: Class
subclass of: Body Part
definition: Hair grown beside the ears as a stringent fulfillment of the biblical prohibition against shaving the 'corners' of one's head (Leviticus 19:27).
preferred label: פאות @he

Soul
type: Class
subclass of: Feature
editorial note: definition missing
editorial note: do we need a sub-class "Nefesh" ?
preferred label: נרנח״י @he

Source
type: Class
definition: The source of a chunk of text. A source must have a reference to its bibliographic description realised in bibframe, describing the work and the instance. It must further identify the relevant part of the instance (e.g. the page(s)) and ideally provides a link to a digital representation. In case of a "canonical source" the relevant part of the work should be identified instead (e.g. chapter and verse). URIs for the instances of this class are set up according to a pattern, which is described here: https://wiki.de.dariah.eu/display/MoG/URIs+for+Sources
example: _:b123 ilanot:hasSource <https://ilanot.org/resource/source/PerushZulati/143> .

Spring
type: Class
subclass of: Feature
definition: Iconographical representation of source of divine abudance as a FOUNTAIN (מזרקה)
editorial note: revise definition
preferred label: מעיין @he

Subject
type: Class
definition: The subject of a piece of textual content

Sun (Planet)
type: Class
subclass of: Planet
editorial note: check hebrew label
editorial note: definition missing
preferred label: שמש @he

Sunrays
type: Class
subclass of: Feature
editorial note: definition missing
preferred label: קרני שמש @he

Supernal Fire
type: Class
subclass of: Abundance
disjoint with: Supernal Water
editorial note: definition missing
preferred label: אש @he

Supernal Water
type: Class
subclass of: Abundance
editorial note: definition missing
preferred label: מים @he

Surface
type: Class
definition: A surface of a manuscript that holds the graphic and textual content understood as a geometric plane. The surface is to be understood as a proxy or rather an abstraction for the actualy material piece/surface of the manuscript and the the digital image that shows it (in so far as the surface's size is measured in pixels). Any coordinates of an area on that surface are to be understood in relation to the surface's height and width in px)
example: item:surface3vsh a ilanot:Surface ; ilanot:isShownBy textgrid:3vshb ; ilanot:isSurfaceOf item:manuscript3vsh6 ; ilanot:nextSurface item:surface3vv10 ; ilanot:surfaceHeight 14752 ; ilanot:surfaceWidth 11696 ; ilanot:verso item:surface3vv10 .

Sword
type: Class
subclass of: Feature
definition: The sword placed between the cherubim guarding the Tree of Life in Genesis 3.24.
example: https://dev.ilanot.org/detail#1/-27/113
preferred label: חרב @he

Taurus
type: Class
subclass of: Astrological Sign
definition: The second astrological sign of thet zodiac. The Sun transits in this sign from approximately April 20 until May 20 each year. (see https://en.wikipedia.org/wiki/Taurus_(astrology))
editorial note: check hebrew label
preferred label: שור @he

Tehiru
type: Class
subclass of: Feature
alternative label: Brilliance
definition: The light of Ein Sof before the ẓimẓum; The primordial void created by ẓimẓum.
preferred label: טהירו @he

Temple
type: Class
subclass of: Feature
editorial note: definition missing
preferred label: מקדש @he

Temple/Tabernacle Vessels
type: Class
subclass of: Feature
definition: The vessels of the Temple/Tabernacle in symbolic meaning
preferred label: כלי המקדש @he

Tetragrammaton
type: Class
subclass of: Holy Name
editorial note: missing definition
preferred label: י-ה-ו-ה @he

Tevunah
type: Class
subclass of: Parẓuf
alternative label: Comprehension
definition: The lower maternal Parẓuf that processes and adapts divine flow for transmission to lower configurations.
preferred label: תבונה @he

Text Block
type: Class
subclass of: Descriptive Element
definition: An area that contains text explaining or discussing any of the depicted features or any other topic. A text block is distinguished from a "Label" by the nature of the textual content it contains. While a label identifies or points to a specific feature, a text block contains discursive text.
preferred label: תיבת טקסט @he

Text Content
type: Class
subclass of: Content
definition: An abstraction of the textual content of a zone. The purpose of this class is to link the transcription of a text to its translation, souce, subjects etc.
example: item:region_14b62ea5-6456-4ea9-ddc0-dff427f6c35b a ilanot:Zone ; ilanot:hasContent [ ilanot:hasSource <https://ilanot.org/resource/source/PerushZulati/143> ; ilanot:hasTranscription " ... "^^rdf:XMLLiteral ; ilanot:hasTranslation " ... "^^rdf:XMLLiteral ] .

Textgrid Aggregation
type: Class
date: 2021-03-30T08:16:15Z
definition: An aggregation of files in Textgrid, which groups resources that logically belong together (e.g. a digital image of a manuscript's surface and the TEI transcription of it's content). URIs for Textgrid Aggregations are generated by Textgrid (in the textgrid: namespace)
example: <https://ilanot.org/resource/item/manuscript3r0gg> ilanot:textgridAggregation textgrid:3r0gg .

The Head That Is Not Known
type: Class
subclass of: Feature
definition: The inner dimension of the lower seven Sefirot within Malkhut of Adam Kadmon; also referred to as Atik Yomin.
preferred label: רישא דלא אתידע @he

Three Heads of Arikh Anpin
type: Class
subclass of: Feature
definition: A notion based on a zoharic teaching according to which “the three heads of ‘Atika are one inside the other, one over the other, and yet they are one head, the head of all heads that is not a head, for no one knows what is in that head” (Zohar III:288b).
preferred label: תלת רישין דא״א @he

Throat
type: Class
subclass of: Body Part
definition: The 'throat' mediating between divine thought and speech
preferred label: גרון @he

Throne of Glory
type: Class
subclass of: Feature
definition: Driver’s seat atop Ezekiel’s chariot
preferred label: כסא הכבוד @he

Tiferet
type: Class
subclass of: Sefirah
subclass of: Restriction
  on property: part of
  some values from: Lower Sefirot
alternative label: Beauty
definition: The sixth of the ten Sefirot
preferred label: תפארת @he

Tikkun
type: Class
subclass of: Worlds
alternative label: Rectification
editorial note: definition missing
preferred label: עולם התקון @he

Tohu
type: Class
subclass of: Worlds
alternative label: Chaos
editorial note: definition missing
preferred label: עולם התוהו @he

Tree of Knowledge
type: Class
subclass of: Feature
subclass of: Restriction
  on property: part of
  some values from: Gan Eden
editorial note: definition missing
preferred label: עץ הדעת @he

Tree of Life
type: Class
subclass of: Feature
subclass of: Restriction
  on property: part of
  some values from: Gan Eden
editorial note: definition missing
preferred label: עץ החיים @he

Twelve Tribes
type: Class
subclass of: Feature
definition: The symbolic twelve tribes
preferred label: י״ב שבטים @he

Udder
type: Class
subclass of: Body Part
definition: The animal-form 'breasts' channeling basic divine sustenance.
preferred label: דדי בהמה @he

Upper Mustache
type: Class
subclass of: Body Part
definition: The lower 'lip' tempering aspects of divine judgment
preferred label: שפם תחתון @he

Upper Sefirot
type: Class
subclass of: Feature
subclass of: Restriction
  on property: part of
  some values from: Ilan
definition: Keter, Hokmah and Binah as a group being part of an ilan
preferred label: ספירות עליונות @he

Variant Items
type: Class
creator: http://orcid.org/0000-0003-3572-6170
date: 2021-04-09T06:40:24Z
subclass of: Annotation
definition: An annotation that groups together instances of ilanot:MapItem located on different instances of ilanot:Surface because they are considered equivalent in the way that they represent the same thing (concept, feature, text quotation) but show variation in the way they are expressed. This annotation should only be applied to manuscripts that are considered as belonging to a manuscript family. (What consitutes a manuscript familiy is out of the scope of this definition, though) The map items that are considered to be variant are given in the target of this annotation as items of a composite group (oa:Composite). This composite group must (of course) always have more than one member. If the variation of two manuscripts consists of a certain map item being omitted (or for other reason missing), this missing item should be represented by a blank node, containing a statement on the surface it would be located on if it weren't missing and a statement stating the fact that it is missing (using ilanot:missing). Any editorial comment on the group of variant items as a whole can be given in the annotation's body, any comment on an individual member of this group of variant items should be given as an annotation on the individual item itself, unless the type or nature of the variation is evident already from the description of that individual item (which in most cases will be the case)
example: # Describing a group of variant Map Items (on different manuscripts/surfaces) # on the third surface/mansucript the respecitve map item is missing. # there is a certain difficulty in pointing to something that does not exist, like in # "that pink elephant in front of your window that is not there..." example:Annotation5 a ilanot:VariantItems ; oa:hasBody [ a oa:TextualBody ; rdf:value " Any comment on the variants here... " ; dc:language "en"; dc:format "application/tei+xml". ] ; oa:hasTarget [ a oa:Composite ; as:items ( item:mapitem_12345 item:mapitem_98765 [ a ilanot:MapItem ; ilanot:missing true ; ilanot:hasZone [ a ilanot:Zone ; ilanot:hasArea [ a ilanot:Area ; ilanot:isLocatedOn item:surface12345 ; ] ] ] ) . ]

Veil of the Covering
type: Class
subclass of: Partition
definition: Element separating Divine Glory (Kavod) and "Outer Angels" - term borrowed from curtain covering Holy Ark (Exodus 35, 12).
preferred label: פרוכת המסך @he

Venus (Planet)
type: Class
subclass of: Planet
editorial note: check hebrew label
editorial note: definition missing
preferred label: נוגה @he

Virgo
type: Class
subclass of: Astrological Sign
definition: The sixth astrological sign of the zodiac. The Sun transits this sign approximately between August 23 and September 22 each year (see https://en.wikipedia.org/wiki/Virgo_(astrology))
editorial note: check hebrew label
preferred label: בתולה @he

Wall
type: Class
subclass of: Feature
editorial note: definition missing
example: https://dev.ilanot.org/detail#3.00/-63.70/91.38
preferred label: קיר @he

Water (Element)
type: Class
subclass of: Element
editorial note: definition missing
preferred label: מים (יסוד) @he

Wheel
type: Class
subclass of: Feature
editorial note: definition missing
example: https://dev.ilanot.org/detail#5.000/-58.335/101.637
example: https://dev.ilanot.org/detail#3.00/-63.70/91.38
preferred label: גלגל @he

Wing
type: Class
subclass of: Decorative Element
definition: Limb for flight
preferred label: כנף @he

Ya'akov
type: Class
subclass of: Parẓuf
alternative label: Jacob
definition: A Parẓuf derived from Zeir Anpin's lower body, with affinity to Abba.
preferred label: יעקב @he

Yesod
type: Class
subclass of: Sefirah
subclass of: Restriction
  on property: part of
  some values from: Lower Sefirot
alternative label: Foundation
definition: The ninth of the ten Sefirot
preferred label: יסוד @he

Yesod and Malkhut
type: Class
subclass of: FeatureGroup
subclass of: Restriction
  on property:
    inverse of: part of
  some values from: Malkhut
subclass of: Restriction
  on property:
    inverse of: part of
  some values from: Yesod
preferred label: יסוד ומלכות @he

Yeẓirah
type: Class
subclass of: Worlds
alternative label: Formation
definition: The World of formation
preferred label: עולם היצירה @he

Yosher
type: Class
subclass of: Feature
alternative label: Linear Emanation
definition: Linear lights that enter the sphere cleared by the ẓimẓum (withdrawal); identified with Adam Kadmon (Primordial Adam).
preferred label: יושר @he

Zeir Anpin
type: Class
subclass of: Parẓuf
alternative label: Impatient
alternative label: Short Face
definition: The main masculine Parẓuf embodying the primary divine emotional forces.
preferred label: זעיר אנפין @he

Ẓerufei Otiot
type: Class
subclass of: Feature
alternative label: Letter Combination
definition: The permutations of Hebrew letters through which creation manifests.
preferred label: צירופי אותיות @he

Zilpah
type: Class
subclass of: Parẓuf
definition: The external aspect of Leah channeling judgments downward.
preferred label: זלפה @he

Ẓimẓum
type: Class
subclass of: Feature
alternative label: Auto-Evacuation
definition: The auto-evacuation of Ein Sof that cleared the spherical void for the subsequent emanation of Worlds.
preferred label: צמצום @he

Channel
type: Class
subclass of: Feature
subclass of: Restriction
  on property: part of
  some values from: Ilan
alternative label: Ẓinnor
definition: A path connecting two Sefirot in an ilan. A channel through which divine influence flows between levels.
preferred label: צינור @he

Zodiac
type: Class
subclass of: Feature
subclass of: Restriction
  on property: part of
  some values from: Heavens
definition: The twelve astrological signs - often represented in a circular diagram (rota) of the heavens that includes the planets and the stars
preferred label: מזלות @he

Astrological Sign
type: Class
subclass of: Feature
subclass of: Class
  union of: Aquarius
  union of: Aries
  union of: Cancer
  union of: Capricorn
  union of: Gemini
  union of: Leo
  union of: Libra
  union of: Pisces
  union of: Sagittarius
  union of: Scorpio
  union of: Taurus
  union of: Virgo
subclass of: Restriction
  on property: part of
  some values from: Zodiac
definition: One of the twelve sections of the zodiac, traditionally associated with a stellar constellation on the ecliptic, through which the the sun seems to move at a certain time of the year.
editorial note: hebrew label identical to https://ilanot.org/voc/ontology#Zodiac @he
preferred label: מזלות @he

Zone
type: Class
subclass of: Restriction
  on property: has area
  some values from: Area
definition: The combination of a geometrically defined area on a manuscript's surface and its (textual or figurative) content.
example: item:region_ea31fae6-bc81-4dfd-8b70-2cae718cec8e a ilanot:Zone ; ilanot:hasArea [ ilanot:hasCoordinates "<svg:rect></svg:rect>"^^rdf:XMLLiteral ; ilanot:hasSize "0.000104971993587555"^^xsd:double ; ilanot:isLocatedOn item:surface3r6h ] ; ilanot:hasContent [ ilanot:hasTranscription " ... "^^rdf:XMLLiteral ; ilanot:hasTranslation " ... "^^rdf:XMLLiteral ] ; ilanot:zoneId "region_ea31fae6-bc81-4dfd-8b70-2cae718cec8e" ; ilanot:zoneName "3.2.8" .

contains
type: ObjectProperty
type: TransitiveProperty
sub property of: is spatially related to
definition: Expresses that the range zone is fully contained within the domain zone (within a margin of error).

describes
type: ObjectProperty
domain: Descriptive Element
range: Feature
definition: Describes the relationship between a text area (Descriptive Element) and a feature

Electronic Identifier
type: DatatypeProperty
domain: Digital Facsimile
range: string
definition: An electronic identifier of a Digital Facsimile.

Facsimile License
type: DatatypeProperty
domain: Digital Facsimile
range: string
definition: The license of a Digital Facsimile.

Facsimile Note
type: DatatypeProperty
domain: Digital Facsimile
range: string
definition: A note about a Digital Facsimile.

Facsimile Publisher
type: DatatypeProperty
domain: Digital Facsimile
range: string
definition: The publisher of a Digital Facsimile.

Facsimile Title
type: DatatypeProperty
domain: Digital Facsimile
range: string
definition: The title of a Digital Facsimile.

family type
type: ObjectProperty
definition: The kind of diagram family. Current options include lurianic and classical.

found on
type: ObjectProperty
domain: Diagram
range: Surface
definition: Describes that a diagram is found (completely or in part) on a specific surface of a manuscript.

has aesthetic characterization
type: ObjectProperty
domain: Diagram
range: Aesthetic Characterization
definition: Connects a diagram with an aesthetic characteristic it has, e.g. being in colors or showing a specific level of craftmansship.

has area
type: ObjectProperty
type: FunctionalProperty
type: InverseFunctionalProperty
domain: Zone
range: Area
definition: Identifies the Area (i.e. the part of a manuscript's surface) that constitutes the given Zone
example: # In the Maps of God portal, an Area is represented by a blank node item:region_5c0773bc-ac03-4059-a5d2-8693cafe154d a ilanot:Zone ; ontology:hasArea [ a ilanot:Area ; ilanot:hasCoordinates "<svg:polygon>...</svg:polygon>"^^rdf:XMLLiteral ; ilanot:hasSize "0.000935030400012648"^^xsd:double ; ilanot:isLocatedOn item:surface3vr9 ] .

has content
type: ObjectProperty
domain: Zone
range: Content
definition: Identifies the content of the given Zone
example: # In the Maps of God portal, a "Content" block is represented by a blank node item:region_5c0773bc-ac03-4059-a5d2-8693cafe154d a ilanot:Zone ; ilanot:hasContent [ a ilanot:TextContent; ilanot:hasTranscription " ... "^^rdf:XMLLiteral ; ilanot:hasTranslation " ... "^^rdf:XMLLiteral ] .

has context
type: ObjectProperty
domain: Diagram
range: Context
definition: Connects a diagram with a historical context in which it was produced to be used, e.g. as amulet, for prayer or for hermeneutical purposes.

Coordinates
type: DatatypeProperty
domain: Area
range: XMLLiteral
definition: An svg representation of the geometric form the Area is represented by on the surface of the manuscript
example: item:region_ea31fae6-bc81-4dfd-8b70-2cae718cec8e a ilanot:Zone ; ilanot:hasArea [ ilanot:hasCoordinates '''<svg:rect xmlns:svg="http://www.w3.org/2000/svg" height="67" id="shape_region_ea31fae6-bc81-4dfd-8b70-2cae718cec8e" width="266" x="3959" y="17305"></svg:rect>'''^^rdf:XMLLiteral ; a ilanot:Area ] .

has facsimile
type: ObjectProperty
domain: Surface
range: Digital Facsimile
definition: Links a manuscript's surface to a digital image of that surface

has family
type: ObjectProperty
domain: Diagram
range: Family
definition: Expresses that a Diagram belongs to a specific Family.

has primary facsimile
type: ObjectProperty
sub property of: has facsimile
definition: Links a manuscript's surface to the digital image of that surface which should be displayed on the portal.

Has Research Literature
type: DatatypeProperty
domain: Diagram
range: string
definition: Bibliographical information about a piece of research literature treating this diagram.

has shape
type: ObjectProperty
domain: Class
  union of: Descriptive Element
  union of: Feature
  union of: Group
range: Shape
definition: Indicates the Shape of a Map Item
example: # This sephira Binah has the shape of a circle item:mapitem_37405340-1cc2-4d02-9539-402089092ec5 a ilanot:Binah ; ilanot:hasShape shape:c_6814260f .

Area Size
type: DatatypeProperty
type: FunctionalProperty
date: 2020-06-26T11:34:14Z
domain: Area
range: double
sub property of: Format
definition: The size of an area relative to the size of the surface it is located on. The calculation of this value is based on the svg point-coordinates of the described area on the digital image of the manuscript's surface. The maximum value for this property is 1.0 which would indicate that the area covers the whole surface.

has source
type: ObjectProperty
domain: Text Content
range: Source
definition: Identifies the source of a chunk of text found on the manuscript
example: # The source of the textual content of the given zone is from Reuven Sarfati's Perush Zulati, page 143 of the Becker 2013 edition item:region_14b62ea5-6456-4ea9-ddc0-dff427f6c35b a ilanot:Zone ; ilanot:hasContent [ ilanot:hasSource <https://ilanot.org/resource/source/PerushZulati/143> ].

has subject
type: ObjectProperty
domain: Text Content
range: Subject
definition: Indicates a topic (subject) a chunk of text found on the manuscript is about

Has Transcription
type: DatatypeProperty
domain: Text Content
range: XMLLiteral
definition: The transcription of the textual content (i.e. the Hebrew or Aramaic text) of a zone in TEI

Has Translation
type: DatatypeProperty
domain: Text Content
range: XMLLiteral
definition: The translation of a chunk of text found on the manuscript to English (or any other language than the original)

has work
type: ObjectProperty
date: 2020-12-10T17:44:36Z
domain: Source
range: Work
definition: Indicates the work (in the sense of FRBR) that constitutes a source. The range of this property is http://id.loc.gov/ontologies/bibframe/Work

has zone
type: ObjectProperty
domain: Map Item
range: Zone
definition: Identifies the Zone(s) that represent(s) the given Map Item. One Map Item can be represented by more than one Zones and one Zone in turn may represent more than one Map Item.

Iconclass Notation
type: DatatypeProperty
domain: Figurative Content
range: string
definition: The Iconclass class notation identifying any figurative content

Image Description
type: DatatypeProperty
domain: Figurative Content
range: string
definition: A plain text description of any figurative content found in the manuscript

is close to
type: ObjectProperty
type: SymmetricProperty
sub property of: is spatially related to
definition: Expresses that two zones are spatially close to each other (by a certain limit) but don't overlap.

is connected with
type: ObjectProperty
domain: Map Item
range: Map Item
definition: Expresses the fact that two Map Items are in a non-directional connection with each other. This is limited to a meaningful/semantic connection. E.g. the mere fact of spatial neighborhood does not constitute a connection (spatial relations are covered by the Zone-properties that are sub-properties of isSpatiallyRelatedTo) and the connection does not need to be visibly depicted. E.g., two Sefirot might be said to be connected to each other if there is a channel connecting them.

is continuation of
type: ObjectProperty
sub property of: is in sequence with
inverse of: is continued by
definition: Expresses that a given Map Item is to be understood as directly following another Map Item in a sequence of Map Items. (I.e. it points to the previous item in that series)

is continued by
type: ObjectProperty
sub property of: is in sequence with
definition: Expresses the fact that a given Map Item is directly followed by another Map Item as part of a sequence of Map Items. (I.e. it points to the next item in the sequence).

is expansion of
type: ObjectProperty
domain: Text Block
range: Feature
sub property of: describes
definition: Expresses the fact that a Text Block relates to a Feature in the way that the content of this Text Block is an expansion of the content of that Feature (e.g. an acronym spelled out or similar)

is explanation of
type: ObjectProperty
domain: Text Block
range: Feature
sub property of: describes
definition: Expresses the relationship between a Text Block and a Feature indicating that the content of the Text Block provides an explanation of the Feature.

is in sequence with
type: ObjectProperty
type: SymmetricProperty
domain: Map Item
range: Map Item
definition: Expresses the fact that two Map Items are part of a logical sequence of Map Items. Use the sub-properties isContinuationOf and isContinuedBy to express that two Map Items follow each other in the same sequence. The sequence as a whole can be inferred from the expression of direct neighbourhood of its individual members.

is introduction of
type: ObjectProperty
domain: Text Block
range: Feature
sub property of: describes
definition: Expresses the relationship between a Text Block and a Feature indicating that the content of the Text Block provides an introduction to the depicted Feature.

is label of
type: ObjectProperty
domain: Label
range: Feature
sub property of: describes
definition: Expresses the relationship between a Text Block and a Feature indicating that the content of the Text Block provides a label of the Feature.

is located on
type: ObjectProperty
domain: Area
range: Surface
definition: Links a given area to the manuscript's surface it is found on

is shown by
type: DatatypeProperty
domain: Surface
range: anyURI
deprecated: deprecated from version 0.9.6 onwards. Use object property "hasFacsimile" instead
definition: the digital image of a manuscript's surface

is spatially related to
type: ObjectProperty
domain: Zone
range: Zone
definition: Expresses that two zones are spatially related to each other. Only its sub-properties should be used.

is surface of
type: ObjectProperty
date: 2020-06-22T16:20:02Z
domain: Surface
range: Manuscript
definition: Connects an instance of the class "Surface" with the corresponding instance of the class "Manuscript"
example: <https://ilanot.org/resource/item/surface3vv1> ilanot:isSurfaceOf <https://ilanot.org/resource/item/manuscript3vsh6> .

Life Dates
type: DatatypeProperty
domain: Agent
range: string
definition: The life dates of the person.

Missing on Diagram
type: DatatypeProperty
type: FunctionalProperty
creator: http://orcid.org/0000-0003-3572-6170
date: 2021-04-09T11:36:05Z
domain: Map Item
range: boolean
definition: Indicates that a map item, which could reasonably be assumed or expected to be present on the surface of a diagram in a specific position is not there. There is no assumption applied as to why the map item is missing on the given surface. The property is meant to be used in ilanot:VariantItems annotations to make explicit that one of the witnesses omits a map item (feature, decorative or descriptive element) that the others have.
example: example:Annotation5 a ilanot:VariantItems ; oa:hasBody [] ; oa:hasTarget [ a oa:Composite ; as:items ( item:mapitem_12345 item:mapitem_98765 [ a ilanot:MapItem ; ilanot:missing true ; ilanot:hasZone [ a ilanot:Zone ; ilanot:hasArea [ a ilanot:Area ; ilanot:isLocatedOn item:surface12345 ; ] ] ] ) . ]

next surface
type: ObjectProperty
date: 2021-02-05T15:04:35Z
domain: Surface
range: Surface
definition: Expresses the fact that another surface follows the current one in an ordered sequence (e.g. pages in a book). The value of this property is the surface that follows. I.e. understand it as "next surface is..." and not as "next surface of...". Fragments that in combination make up a reconstructed surface of a manuscript are not(!) connected among each other by this property. Use 'partOfSurface' instead.
example: # There is a sequence of surfaces; item:surface3vsh is followed by item:surface3vv10 item:surface3vsh ilanot:nextSurface item:surface3vv10 .

overlaps with
type: ObjectProperty
type: SymmetricProperty
sub property of: is spatially related to
definition: Expresses that two zones overlap spatially (within a margin of error).

part of
type: ObjectProperty
type: TransitiveProperty
domain: Map Item
range: Class
  union of: Feature
  union of: Group
definition: Expresses the fact that a given feature is part of another feature. This property expresses a transitive relationship. I.e. if some feature A is part of some other feature B and B is itself part of some feature C, then feature A is also part of feature C. Since the relationship between A and C can be inferred from their respective relationships to B, it is therefore not recommended to explicitly state the fact that A is part of C.

part of source
type: ObjectProperty
date: 2021-02-05T11:03:01Z
domain: Source
range: Source
definition: Expresses the fact that a source is part of a (larger) source. Since a source is defined as a chunk of text, this chunk of text is typically part of a broader unit (i.e. a range of verses is part of a chapter, a chapter is part of a book etc.) This property is not intended to be used to express text reuse, i.e. quoting or 'stealing' the text of a source within a completely different source that is not a broader source to the given source.

part of surface
type: ObjectProperty
date: 2021-02-05T15:01:06Z
domain: Surface
range: Surface
definition: Expresses the fact that one surface is actually a part of another (larger) surface. This property is used to reconstruct a (destroyed or damaged) manuscript's original surface from fragments thereof.

recto
type: ObjectProperty
date: 2021-02-05T15:26:19Z
domain: Surface
range: Surface
inverse of: verso
definition: Links the surface on the verso side of a manuscript or a page to the surface on its recto side. For ordered sequences use "nextSurface" (instead or in addition)
example: <https://ilanot.org/resource/item/surface3vv1> ilanot:recto <https://ilanot.org/resource/item/surface3vshb> .

relates to
type: ObjectProperty
type: SymmetricProperty
domain: Feature
range: Feature
definition: Expresses the fact that a given Feature relates to another Feature in some way. In particular, this describes the relationship between a Feature displayed on a manuscript and another Feature to which it is related in some hidden way but which may or may not be present on the same manuscript.

Representative Configuration
type: DatatypeProperty
domain: Configuration
range: boolean
definition: Specifies whether or not this Configuration has been annotated fully and can stand in as a representative for other Diagrams featuring it.

Representative Diagram
type: DatatypeProperty
domain: Diagram
range: boolean
definition: Specifies whether or not this Diagram has been annotated fully and can stand in as a representative for Diagrams of the same Family.

Representative Information
type: DatatypeProperty
domain: Diagram
range: string
definition: Provides text which shall be displayed in the portal about the representativeness of this diagram, e.g. where to find a more representative diagram of the same family.

Role Description
type: DatatypeProperty
domain: Contributor role
range: string
definition: Plain text description of the contribution role.

Surface Height
type: DatatypeProperty
type: FunctionalProperty
domain: Surface
range: integer
sub property of: Format
definition: The height of the surface (in px)
example: # the surface item:surface3vsh has a height of 14,752 px item:surface3vsh ilanot:surfaceHeight "14752"^^xsd:integer .

Surface Width
type: DatatypeProperty
type: FunctionalProperty
domain: Surface
range: integer
sub property of: Format
definition: The width of the surface in px
example: # surface item:surface3vsh has a width of 11,696 px item:surface3vsh ilanot:surfaceWidth "11696"^^xsd:integer

textgrid aggregation
type: ObjectProperty
date: 2021-03-30T08:14:04Z
domain: Diagram
range: Textgrid Aggregation
definition: Expresses that a Manuscript is part of a Textgrid Aggregation
example: <https://ilanot.org/resource/item/manuscript3r0gg> ilanot:textgridAggregation textgrid:3r0gg .

transcribal accuracy
type: DatatypeProperty
domain: Diagram
range: boolean
definition: Specifies whether or not this diagram has been inaccurately copied from other manuscripts.

verso
type: ObjectProperty
date: 2021-02-05T15:24:25Z
domain: Surface
range: Surface
definition: Links the surface of the recto side of a manuscript or a page to the surface on its verso side. For ordered sequences use "nextSurface" (instead or in addition).
example: # item:surface3vsh is the recto (i.e. the "front") of item:surface3w10 (the "back") item:surface3vsh ilanot:verso item:surface3vv10.

Zone ID
type: DatatypeProperty
type: FunctionalProperty
domain: Zone
range: string
definition: An (automatically assigned) identifier for a zone. Other than the zone's name, this identifier is unique throughout the whole data set / knowledge graph. In the Maps of God project, the Zone ID is a UUID generated by TriVIA
example: item:region_ea31fae6-bc81-4dfd-8b70-2cae718cec8e a ilanot:Zone ; ilanot:zoneId "region_ea31fae6-bc81-4dfd-8b70-2cae718cec8e" .

Zone Name
type: DatatypeProperty
type: FunctionalProperty
domain: Zone
range: string
sub property of: Name
definition: A manually assigend string of characters that indentifies a zone. A zone name is typically a hierarchically structured sequence of numbers and is used to establish a link between the zone and its textual content stored in a separate TEI file.
example: item:region_ea31fae6-bc81-4dfd-8b70-2cae718cec8e a ilanot:Zone ; ilanot:zoneName "3.2.8" .